{"text_format":"1","workbook":"xlsx","n_sheets":4,"sheets":["Master Database - amended","READ ME","Device Selector","HIDDEN LISTS"],"not_rendered":{"charts":0,"images":0,"macros":1,"external_links":0,"defined_names":2,"comments":0,"pivot_tables":0},"unopened":[],"bounds":{"document_bytes":16777216,"sheet_cells":100000,"rows_first":2000,"rows_last":500,"rows_between":2000,"halvings":0,"cell_chars":16384,"cell_head_chars":4096},"cells_cut":0,"cells_raw":0,"read":"whole","date_system":"1900"}

{"sheet":"Master Database - amended","index":0,"n_rows":237,"n_cols":41,"rows_kept":237,"cut":false,"hidden":true,"merged":[[0,3,1,3],[0,4,1,6],[0,7,1,8]]}
[null,null,null,"Hearing Groups","Device",null,null,"Further Details",null,null,null,"Acoustic characteristics",null,null,null,null,null,null,null,null,null,null,null,null,"Species Group(s) - evidence score",null,null,null,null,null,null,null,null,"Mitigation range"]
[null,null,null,null,null,null,null,null,null,null,null,"Source level",null,null,null,null,null,null,null,null,null,null,null,null,"Evidence score showing known (and proven) efficacy on each receptor group"]
["Helper Column 1","Helper Column 2","Helper Column 3","LF, MF, HF, PW, All Species, All Devices","ID","Make","Model","Control (manual / automatic)","Link to manufacturer website",null,"Current known use","rms, dB re 1 μPa re 1 m","pk, dB re 1 μPa re 1 m","SEL, dB re 1 μPa2s re 1 m (per pulse)","Lowest Frequency (kHz)","Highest Frequency (kHz)","Source frequency(s), Hz","Shortest Pulse Interval, ms","Longest Pulse Interval, ms","Intermittency","Continuous / pulsed","Shortest Pulse Width, ms","Longest Pulse Width, ms","Pulse width, ms","LF Confidence Score","Effective on Species (Y/N)","HF Confidence Score","Effective on Species (Y/N)","VHF Confidence Score","Effective on Species (Y/N)","PW Confidence Score","Effective on Species (Y/N)","List of species for which evidence is available","LF mitigation range","HF mitigation range","VHF mitigation range","PW mitigation range","Links to evidence","Links to evidence","Reviewers comments","Comment"]
[1,{"$f":"IF(D4='Device Selector'!$B$6,'Master Database - amended'!A4,\"\")","v":""},{"$f":"IFERROR(SMALL($B$4:$B$200,A4),\"\")","v":8},"Low Frequency Cetaceans",1,"Ace Aquatec","Ace Aquatec Marine Mammal Mitigation Device (A-MMD) Low (Pinnipeds)","Automatic","http://aceaquatec.com/",{"$f":"I4","v":"http://aceaquatec.com/"},"Offshore piling mitigation",182,{"$f":"L4+3","v":185},{"$f":"ROUNDUP(L4+10*LOG10(W4/1000),0)","v":164},0.8,5,"0.8-5 kHz available across ‘Lower,’ ‘Middle,’ ‘Upper,’ and ‘Full’ bands’ \nFlex (Setting 1): 0.9 – 1.4 kHz\nRing (Setting 2): 1.0 – 2.0 kHz\n\nCan be restricted to 1 - 2 kHz)",25000,300000,"Intermittent - duration between pulses is on a random cycle, 12 - 144 per hour selectable.","Intermittent",3.3,14,"Pulse uniformly shorten from 14 ms to 3.3 ms followed by an upshift in the frequency of the tonal components and their equivalent distribution (Lepper et al. 2004)","2: Medium confidence","Y","No Data Available","No Data Available","No Data Available","No Data Available","2: Medium confidence","Y","Pinnipeds and low frequency odontocetes","500 - 1000m","No Data Available","No Data Available","500 - 1000m","https://infrastructure.planninginspectorate.gov.uk/wp-content/ipc/uploads/projects/EN010049/EN010049-001947-Tidal%20lagoon%20(Swansea%20Bay)%20Plc%201.pdf","https://infrastructure.planninginspectorate.gov.uk/wp-content/ipc/uploads/projects/EN010049/EN010049-001947-Tidal%20lagoon%20(Swansea%20Bay)%20Plc%201.pdf","ABPmer conclude that the AceAquatec MMD is recommended as an option should increased mitigation be needed at the tidal lagoon (see conclusions for use of Aquamark 100). Given the potential for wide-scale exclusion impacts on harbour porpoise, this should only be used for short periods of time when a marine mammal is recorded in a defined area in the vicinity of turbines. The use of an automated sonar system to trigger the device is a potentially useful (albeit more costly) tool. Manufacturer update: average source level within a transmission 182dB re 1uPa rms@1m; Frequency > Flex (setting 1) = 0.9-1.4kHz, Ring (setting 2) = 1-2kHz. ","Manufacturer update: average source level within a transmission 182dB re 1uPa rms@1m; Frequency > Flex (setting 1) = 0.9-1.4kHz, Ring (setting 2) = 1-2kHz. "]
[2,{"$f":"IF(D5='Device Selector'!$B$6,'Master Database - amended'!A5,\"\")","v":""},{"$f":"IFERROR(SMALL($B$4:$B$200,A5),\"\")","v":13},"Pinnipeds",1,"Ace Aquatec","Ace Aquatec Marine Mammal Mitigation Device (A-MMD) Low (Pinnipeds)","Automatic","http://aceaquatec.com/",{"$f":"I5","v":"http://aceaquatec.com/"},"Offshore piling mitigation",182,{"$f":"L5+3","v":185},{"$f":"ROUNDUP(L5+10*LOG10(W5/1000),0)","v":164},0.8,5,"0.8-5 kHz available across ‘Lower,’ ‘Middle,’ ‘Upper,’ and ‘Full’ bands’ \nFlex (Setting 1): 0.9 – 1.4 kHz\nRing (Setting 2): 1.0 – 2.0 kHz\n\nCan be restricted to 1 - 2 kHz)",25000,300000,"Intermittent - duration between pulses is on a random cycle, 12 - 144 per hour selectable.","Intermittent",3.3,14,"Pulse uniformly shorten from 14 ms to 3.3 ms followed by an upshift in the frequency of the tonal components and their equivalent distribution (Lepper et al. 2004)","2: Medium confidence","Y","No Data Available","No Data Available","No Data Available","No Data Available","2: Medium confidence","Y","Pinnipeds and low frequency odontocetes","500 - 1000m","No Data Available","No Data Available","500 - 1000m","https://infrastructure.planninginspectorate.gov.uk/wp-content/ipc/uploads/projects/EN010049/EN010049-001947-Tidal%20lagoon%20(Swansea%20Bay)%20Plc%201.pdf","https://infrastructure.planninginspectorate.gov.uk/wp-content/ipc/uploads/projects/EN010049/EN010049-001947-Tidal%20lagoon%20(Swansea%20Bay)%20Plc%201.pdf","ABPmer conclude that the AceAquatec MMD is recommended as an option should increased mitigation be needed at the tidal lagoon (see conclusions for use of Aquamark 100). Given the potential for wide-scale exclusion impacts on harbour porpoise, this should only be used for short periods of time when a marine mammal is recorded in a defined area in the vicinity of turbines. The use of an automated sonar system to trigger the device is a potentially useful (albeit more costly) tool. Manufacturer update: average source level within a transmission 182dB re 1uPa rms@1m; Frequency > Flex (setting 1) = 0.9-1.4kHz, Ring (setting 2) = 1-2kHz. ","Manufacturer update: average source level within a transmission 182dB re 1uPa rms@1m; Frequency > Flex (setting 1) = 0.9-1.4kHz, Ring (setting 2) = 1-2kHz. "]
[3,{"$f":"IF(D6='Device Selector'!$B$6,'Master Database - amended'!A6,\"\")","v":""},17,"All Devices",1,"Ace Aquatec","Ace Aquatec Marine Mammal Mitigation Device (A-MMD) Low (Pinnipeds)","Automatic","http://aceaquatec.com/","http://aceaquatec.com/","Offshore piling mitigation",182,{"$f":"L6+3","v":185},{"$f":"ROUNDUP(L6+10*LOG10(W6/1000),0)","v":164},0.8,5,"0.8-5 kHz available across ‘Lower,’ ‘Middle,’ ‘Upper,’ and ‘Full’ bands’ \nFlex (Setting 1): 0.9 – 1.4 kHz\nRing (Setting 2): 1.0 – 2.0 kHz\n\nCan be restricted to 1 - 2 kHz)",25000,300000,"Intermittent - duration between pulses is on a random cycle, 12 - 144 per hour selectable.","Intermittent",3.3,14,"Pulse uniformly shorten from 14 ms to 3.3 ms followed by an upshift in the frequency of the tonal components and their equivalent distribution (Lepper et al. 2004)","2: Medium confidence","Y","No Data Available","No Data Available","No Data Available","No Data Available","2: Medium confidence","Y","Pinnipeds and low frequency odontocetes","500 - 1000m","No Data Available","No Data Available","500 - 1000m","https://infrastructure.planninginspectorate.gov.uk/wp-content/ipc/uploads/projects/EN010049/EN010049-001947-Tidal%20lagoon%20(Swansea%20Bay)%20Plc%201.pdf","https://infrastructure.planninginspectorate.gov.uk/wp-content/ipc/uploads/projects/EN010049/EN010049-001947-Tidal%20lagoon%20(Swansea%20Bay)%20Plc%201.pdf","ABPmer conclude that the AceAquatec MMD is recommended as an option should increased mitigation be needed at the tidal lagoon (see conclusions for use of Aquamark 100). Given the potential for wide-scale exclusion impacts on harbour porpoise, this should only be used for short periods of time when a marine mammal is recorded in a defined area in the vicinity of turbines. The use of an automated sonar system to trigger the device is a potentially useful (albeit more costly) tool. Manufacturer update: average source level within a transmission 182dB re 1uPa rms@1m; Frequency > Flex (setting 1) = 0.9-1.4kHz, Ring (setting 2) = 1-2kHz. ","Manufacturer update: average source level within a transmission 182dB re 1uPa rms@1m; Frequency > Flex (setting 1) = 0.9-1.4kHz, Ring (setting 2) = 1-2kHz. "]
[4,{"$f":"IF(D7='Device Selector'!$B$6,'Master Database - amended'!A7,\"\")","v":""},23,"All Devices",2,"Ace Aquatec","Ace Aquatec marine Mammal Mitigation Device Ultra-low frequency","Automatic","http://aceaquatec.com/","http://aceaquatec.com/","Offshore piling mitigation",182,187,"No Data Available",0.02,0.09,"20 - 90 Hz","No Data Available","No Data Available","Intermittent. Duration between pulses is on a random cycle.","Intermittent",3.3,14,"Pulse uniformly shorten from 14 ms to 3.3 ms followed by an upshift in the frequency of the tonal components and their equivalent distribution (Lepper et al. 2004)","No Data Available","Y","No Data Available","No Data Available","No Data Available","No Data Available","No Data Available","No Data Available","Fish","<500m","No Data Available","No Data Available","No Data Available","http://www.ascobans.org/sites/default/files/document/Dawson_To-ping-or-not_ESR-2013.pdf\n\nhttps://infrastructure.planninginspectorate.gov.uk/wp-content/ipc/uploads/projects/EN010049/EN010049-001947-Tidal%20lagoon%20(Swansea%20Bay)%20Plc%201.pdf\n\nhttps://www.carbontrust.com/media/675291/orjip-add-study-final-report-stage-1-phase-2.pdf",null,"Manufacturer update: average source level within a transmission 182dB re 1uPa rms@1m; Frequency > 200-900Hz","Manufacturer update: average source level within a transmission 182dB re 1uPa rms@1m; Frequency > 200-900Hz\n\n2: Medium confidence in data for fish"]
[5,{"$f":"IF(D8='Device Selector'!$B$6,'Master Database - amended'!A8,\"\")","v":""},28,"High Frequency Cetaceans",3,"Ace Aquatec","Ace Aquatec marine Mammal Mitigation Device (A-MMD) (Mid-Frequency) Pinnipeds and Cetaceans","Automatic","http://aceaquatec.com/","http://aceaquatec.com/","Offshore piling mitigation",188,{"$f":"L8+3","v":191},{"$f":"ROUNDUP(L8+10*LOG10(W8/1000),0)","v":170},8,20,"8 - 20 kHz","No Data Available","No Data Available","Intermittent - duration between pulses is on a random cycle.","Intermittent",3.3,14,"Pulse uniformly shorten from 14 ms to 3.3 ms followed by an upshift in the frequency of the tonal components and their equivalent distribution (Lepper et al. 2004)","No Data Available","No Data Available","1: Low confidence","Y","No Data Available","No Data Available","No Data Available","No Data Available","Pinnipeds and high-frequency odontoces","No Data Available","500 - 1000m","No Data Available","No Data Available","https://stecf.jrc.ec.europa.eu/documents/43805/44956/Trials+pinger+spacing+DK+2007.pdf\n\nhttps://www.sciencedirect.com/science/article/pii/S0165783607003669\n\nhttp://bycatch.org/articles/can-acoustic-deterrent-devices-reduce-catch-cornish-inshore-gillnet-fishery\n\nhttps://www.researchgate.net/publication/286890618_An_investigation_of_acoustic_deterrent_devices_to_reduce_cetacean_bycatch_in_an_inshore_set_net_fishery\n\nhttp://www.ascobans.org/sites/default/files/document/Dawson_To-ping-or-not_ESR-2013.pdf\n\nhttps://infrastructure.planninginspectorate.gov.uk/wp-content/ipc/uploads/projects/EN010049/EN010049-001947-Tidal%20lagoon%20(Swansea%20Bay)%20Plc%201.pdf","https://stecf.jrc.ec.europa.eu/documents/43805/44956/Trials+pinger+spacing+DK+2007.pdf\n\nhttps://www.sciencedirect.com/science/article/pii/S0165783607003669\n\nhttp://bycatch.org/articles/can-acoustic-deterrent-devices-reduce-catch-cornish-inshore-gillnet-fishery\n\nhttps://www.researchgate.net/publication/286890618_An_investigation_of_acoustic_deterrent_devices_to_reduce_cetacean_bycatch_in_an_inshore_set_net_fishery\n\nhttp://www.ascobans.org/sites/default/files/document/Dawson_To-ping-or-not_ESR-2013.pdf\n\nhttps://infrastructure.planninginspectorate.gov.uk/wp-content/ipc/uploads/projects/EN010049/EN010049-001947-Tidal%20lagoon%20(Swansea%20Bay)%20Plc%201.pdf","ABPmer conclude that the AceAquatec MMD is recommended as an option should increased mitigation be needed at the tidal lagoon (see conclusions for use of Aquamark 100). Given the potential for wide-scale exclusion impacts on harbour porpoise, this should only be used for short periods of time when a marine mammal is recorded in a defined area in the vicinity of turbines. The use of an automated sonar system to trigger the device is a potentially useful (albeit more costly) tool. Manufacturer update: average source level within a transmission 188dB re 1uPa rms@1m; Frequency = 8-24kHz","Manufacturer update: average source level within a transmission 188dB re 1uPa rms@1m; Frequency = 8-24kHz"]
[6,{"$f":"IF(D9='Device Selector'!$B$6,'Master Database - amended'!A9,\"\")","v":""},32,"Pinnipeds",3,"Ace Aquatec","Ace Aquatec marine Mammal Mitigation Device (A-MMD) (Mid-Frequency) Pinnipeds and Cetaceans","Automatic","http://aceaquatec.com/","http://aceaquatec.com/","Offshore piling mitigation",188,191,170,8,20,"8 - 20 kHz","No Data Available","No Data Available","Intermittent - duration between pulses is on a random cycle.","Intermittent",3.3,14,"Pulse uniformly shorten from 14 ms to 3.3 ms followed by an upshift in the frequency of the tonal components and their equivalent distribution (Lepper et al. 2004)","No Data Available","No Data Available","1: Low confidence","Y","No Data Available","No Data Available","No Data Available","No Data Available","Pinnipeds and high-frequency odontoces","No Data Available","500 - 1000m","No Data Available","No Data Available","https://stecf.jrc.ec.europa.eu/documents/43805/44956/Trials+pinger+spacing+DK+2007.pdf\n\nhttps://www.sciencedirect.com/science/article/pii/S0165783607003669\n\nhttp://bycatch.org/articles/can-acoustic-deterrent-devices-reduce-catch-cornish-inshore-gillnet-fishery\n\nhttps://www.researchgate.net/publication/286890618_An_investigation_of_acoustic_deterrent_devices_to_reduce_cetacean_bycatch_in_an_inshore_set_net_fishery\n\nhttp://www.ascobans.org/sites/default/files/document/Dawson_To-ping-or-not_ESR-2013.pdf\n\nhttps://infrastructure.planninginspectorate.gov.uk/wp-content/ipc/uploads/projects/EN010049/EN010049-001947-Tidal%20lagoon%20(Swansea%20Bay)%20Plc%201.pdf","https://stecf.jrc.ec.europa.eu/documents/43805/44956/Trials+pinger+spacing+DK+2007.pdf\n\nhttps://www.sciencedirect.com/science/article/pii/S0165783607003669\n\nhttp://bycatch.org/articles/can-acoustic-deterrent-devices-reduce-catch-cornish-inshore-gillnet-fishery\n\nhttps://www.researchgate.net/publication/286890618_An_investigation_of_acoustic_deterrent_devices_to_reduce_cetacean_bycatch_in_an_inshore_set_net_fishery\n\nhttp://www.ascobans.org/sites/default/files/document/Dawson_To-ping-or-not_ESR-2013.pdf\n\nhttps://infrastructure.planninginspectorate.gov.uk/wp-content/ipc/uploads/projects/EN010049/EN010049-001947-Tidal%20lagoon%20(Swansea%20Bay)%20Plc%201.pdf","ABPmer conclude that the AceAquatec MMD is recommended as an option should increased mitigation be needed at the tidal lagoon (see conclusions for use of Aquamark 100). Given the potential for wide-scale exclusion impacts on harbour porpoise, this should only be used for short periods of time when a marine mammal is recorded in a defined area in the vicinity of turbines. The use of an automated sonar system to trigger the device is a potentially useful (albeit more costly) tool. Manufacturer update: average source level within a transmission 188dB re 1uPa rms@1m; Frequency = 8-24kHz","Manufacturer update: average source level within a transmission 188dB re 1uPa rms@1m; Frequency = 8-24kHz"]
[7,{"$f":"IF(D10='Device Selector'!$B$6,'Master Database - amended'!A10,\"\")","v":""},40,"All Devices",3,"Ace Aquatec","Ace Aquatec marine Mammal Mitigation Device (A-MMD) (Mid-Frequency) Pinnipeds and Cetaceans","Automatic","http://aceaquatec.com/","http://aceaquatec.com/","Offshore piling mitigation",188,191,170,8,20,"8 - 20 kHz","No Data Available","No Data Available","Intermittent - duration between pulses is on a random cycle.","Intermittent",3.3,14,"Pulse uniformly shorten from 14 ms to 3.3 ms followed by an upshift in the frequency of the tonal components and their equivalent distribution (Lepper et al. 2004)","No Data Available","No Data Available","1: Low confidence","Y","No Data Available","No Data Available","No Data Available","No Data Available","Pinnipeds and mid-frequency odontoces","No Data Available","500 - 1000m","No Data Available","No Data Available","https://stecf.jrc.ec.europa.eu/documents/43805/44956/Trials+pinger+spacing+DK+2007.pdf\n\nhttps://www.sciencedirect.com/science/article/pii/S0165783607003669\n\nhttp://bycatch.org/articles/can-acoustic-deterrent-devices-reduce-catch-cornish-inshore-gillnet-fishery\n\nhttps://www.researchgate.net/publication/286890618_An_investigation_of_acoustic_deterrent_devices_to_reduce_cetacean_bycatch_in_an_inshore_set_net_fishery\n\nhttp://www.ascobans.org/sites/default/files/document/Dawson_To-ping-or-not_ESR-2013.pdf\n\nhttps://infrastructure.planninginspectorate.gov.uk/wp-content/ipc/uploads/projects/EN010049/EN010049-001947-Tidal%20lagoon%20(Swansea%20Bay)%20Plc%201.pdf","https://stecf.jrc.ec.europa.eu/documents/43805/44956/Trials+pinger+spacing+DK+2007.pdf\n\nhttps://www.sciencedirect.com/science/article/pii/S0165783607003669\n\nhttp://bycatch.org/articles/can-acoustic-deterrent-devices-reduce-catch-cornish-inshore-gillnet-fishery\n\nhttps://www.researchgate.net/publication/286890618_An_investigation_of_acoustic_deterrent_devices_to_reduce_cetacean_bycatch_in_an_inshore_set_net_fishery\n\nhttp://www.ascobans.org/sites/default/files/document/Dawson_To-ping-or-not_ESR-2013.pdf\n\nhttps://infrastructure.planninginspectorate.gov.uk/wp-content/ipc/uploads/projects/EN010049/EN010049-001947-Tidal%20lagoon%20(Swansea%20Bay)%20Plc%201.pdf","ABPmer conclude that the AceAquatec MMD is recommended as an option should increased mitigation be needed at the tidal lagoon (see conclusions for use of Aquamark 100). Given the potential for wide-scale exclusion impacts on harbour porpoise, this should only be used for short periods of time when a marine mammal is recorded in a defined area in the vicinity of turbines. The use of an automated sonar system to trigger the device is a potentially useful (albeit more costly) tool. Manufacturer update: average source level within a transmission 188dB re 1uPa rms@1m; Frequency = 8-24kHz","Manufacturer update: average source level within a transmission 188dB re 1uPa rms@1m; Frequency = 8-24kHz"]
{"$rows_left_out":228}
{"sheet":"READ ME","index":1,"n_rows":55,"n_cols":2,"rows_kept":55,"cut":false,"hidden":false,"merged":[[54,0,54,13],[12,1,12,15],[13,1,13,15],[14,1,14,15],[15,1,15,15],[16,1,16,15],[17,1,17,15],[18,1,18,15],[19,1,19,15],[20,1,20,15],[21,0,22,0],[21,1,22,15]]}
["JNCC Report No. 615: Evidence base for application of Acoustic Deterrent Devices (ADDs) as marine mammal mitigation (Version 5)"]
[]
["Acoustic Deterrent Device Selection Database - Useful Information"]
[]
["This spreadsheet is a 'live' database and the intent it for it to be updated periodically in line with additional information on the acoustic deterrents described herein, and on the basis of new technologies that become available."]
["Whilst every effort was made to ensure that the information in this database is complete, accurate and up-to-date, no guarantee is provided and JNCC shall have neither liabiloty nor responsibility to any person or entity with"]
["respect to any loss or damage arising from the use of this database. We will act on any inaccuracies that are brought to our attention and will do our best to correct them in subsequent versions of the database."]
[]
["Database Development:"]
[]
{"$rows_left_out":46}
{"sheet":"Device Selector","index":2,"n_rows":87,"n_cols":36,"rows_kept":87,"cut":false,"hidden":false,"merged":[[10,20,10,35],[11,7,12,9],[11,10,12,12],[11,13,12,19],[11,20,11,28],[11,29,11,32],[11,34,13,34],[11,35,13,35],[12,20,12,21],[12,22,12,23],[12,24,12,25],[12,26,12,27],[12,28,13,28],[12,33,13,33],[5,0,6,0],[5,1,6,1],[7,2,8,6],[10,0,12,6],[10,7,10,19]]}
[]
["Acoustic Deterrent Device Selection Database"]
[]
["(Select the desired hearing group from the drop down menu below)"]
[]
["Hearing Group:","Very High Frequency Cetaceans",null,"Generalised Hearing Range*:",null,{"$f":"VLOOKUP(B6,'HIDDEN LISTS'!A4:B8,2,FALSE)","v":"275 Hz to 160 kHz"}]
[]
[null,null,"*Represents the generalised hearing range for the entire group as a composite (i.e. all species within the group), where individual species' hearing ranges are typically not as broad. Generalised hearing range chosen based on ~65 dB threshold from normalised composite audiogram, with the expection for lower limits for LF cetaceans (Southall et al. 2007) and PW pinniped (approximation)."]
[]
[]
{"$rows_left_out":78}
{"sheet":"HIDDEN LISTS","index":3,"n_rows":14,"n_cols":5,"rows_kept":14,"cut":false,"hidden":true,"merged":[]}
[]
[]
["Hearing Group List","Generalised Hearing Range"]
["Low Frequency Cetaceans","7 Hz to 35 kHz"]
["High Frequency Cetaceans","150 Hz to 160 kHz"]
["Very High Frequency Cetaceans","275 Hz to 160 kHz"]
["Pinnipeds","50 Hz to 86 kHz"]
["All Devices","7 Hz to 160 kHz"]
[]
[]
{"$rows_left_out":4}